{"text_format":"2","workbook":"xlsx","n_sheets":5,"sheets":["연차과제 작성안내","과제등록요청서","참여연구원등록조서","실적 배분 신청서","Sheet1"],"not_rendered":{"charts":0,"images":4,"macros":0,"external_links":2,"defined_names":6,"comments":2,"pivot_tables":0},"unopened":[],"bounds":{"document_bytes":16777216,"sheet_cells":100000,"run_cost":"one","rows_first":2000,"rows_last":500,"rows_between":2000,"halvings":0,"cell_chars":16384,"cell_head_chars":4096},"cells_cut":0,"cells_raw":0,"read":"whole","date_system":"1900"}

{"sheet":"연차과제 작성안내","index":0,"n_rows":20,"n_cols":11,"rows_kept":20,"cut":false,"hidden":false,"merged":[[0,0,0,10],[4,0,8,0],[4,1,8,1],[5,2,8,2],[2,1,2,2],[3,1,3,2]]}
["과제등록요청서 작성 방법"]
[]
["구분","연차과제구분",null,"전년도대비","이름","참여구분","참여기간","월기준금액","참여율","월지급금액","인건비구분"]
["신규과제","체크안함",null,"입력안함","입력","입력","입력","입력","입력","입력","입력"]
["연차과제","전년도동일 또는 일부변경중 1개 체크","전년도동일 체크시","입력안함","생략","생략","생략","생략","생략","생략","생략"]
[null,null,"일부변경 체크시","전차동일","입력","생략","생략","생략","생략","생략","생략"]
[null,null,null,"신규참여","입력","입력","입력","입력","입력","입력","입력"]
[null,null,null,"종료","입력","생략","생략","생략","생략","생략","생략"]
[null,null,null,"기간/금액조정","입력","입력","입력","입력","입력","입력","입력"]
{"$rows_empty":9}
["*연차과제_전년도 동일 이란? : 연차과제 참여자가 동일하고 , 참여율 기준금액등의 변동이 없으며 참여기간이 과제기간과 동일한 경우"]
["*연차과제 _일부변경 이란? 연차과제의 참여자가 신규/종료등으로 일부 변경되거나, 참여기간 월지급액등이 일부 변경되는 경우"]

{"sheet":"과제등록요청서","index":1,"n_rows":37,"n_cols":25,"rows_kept":37,"cut":false,"hidden":false,"merged":[[3,0,3,1],[35,0,35,8],[29,0,29,8],[9,0,10,0],[5,0,6,1],[4,0,4,1],[27,2,27,8],[33,7,33,8],[26,0,26,2],[27,0,27,1],[5,2,5,3],[5,4,5,5],[5,6,5,7],[6,2,6,3],[6,4,6,5],[36,0,36,8],[2,0,2,2],[0,0,0,8],[8,0,8,2],[24,1,24,8],[6,6,6,7],[8,5,8,8],[9,1,10,1],[9,2,10,2],[9,3,9,4],[9,5,10,5],[9,6,10,6],[9,7,10,7],[9,8,10,8],[4,2,4,8],[3,2,3,13]]}
["과제등록요청서"]
[]
["과제기본정보"]
["과제명"]
["과제기간등\n주요정보",null,"첨부 (협약용) 사업계획서 참조"]
["기타정보",null,"국가연구개발과제 \n해당 여부",null,"X",null,"학생인건비\n통합관리적용여부",null,"X",{"$nulls":15},false]
[null,null,"참여자지분",null,"연구책임자 100%",null,"카드제구분",null,"연구비카드제"]
[]
["참여연구원 정보",{"$nulls":4},"(연차과제) 전년도와 동일         일부 변경 "]
["전년도\n대비","이름","참여구분","참여기간",null,"월 기준금액","참여율","월지급금액","인건비구분",{"$nulls":8},"국가연구개발","학생인건비통합관리","참여자지분","연구비카드제구분","참여구분","인건비구분","전차대비"]
[null,null,null,"시작","종료"]
[{"$nulls":7},{"$f":"F12*G12","v":0},{"$nulls":9},"O","O","연구책임자 100%","연구비카드제","연구책임자","미지급","전차동일"]
[{"$nulls":7},0,{"$nulls":9},"X","X","공동","개별법인카드제","공동연구원","지급 (내부)","신규참여"]
[{"$nulls":7},0,{"$nulls":13},"연구원","지급 (외부)","종료"]
[{"$nulls":7},0,{"$nulls":13},"연구보조원","지급 (학생인건비)","기간/금액조정"]
[{"$nulls":7},{"$f":"F16*G16","v":0}]
[{"$nulls":7},0]
[{"$nulls":7},0]
[{"$nulls":7},0]
[{"$nulls":7},0]
[{"$nulls":7},0]
[{"$nulls":7},0]
[{"$nulls":7},0]
[{"$nulls":7},0]
[null,"(참여연구원 세부정보 : 첨부 참여연구원 등록요청서 참조)"]
[]
["실행예산"]
["실행예산편성",null,"첨부사업계획서 참조"]
[]
["상기와 같이 협약(계약)에 따른 과제수행을 위하여 과제등록을 요청합니다. "]
[null,null,{"$f":"IF(OR(E7=\"연구책임자 100%\",AND(E7=\"공동\",'실적 배분 신청서'!C16:E16>0)),\"\",\"[실적 배분 신청서]를 제출하여 주시기 바랍니다.\")","v":""}]
[{"$nulls":8},{"$f":"TODAY()","v":"2018-08-04"}]
[]
[{"$nulls":7},{"$f":"IFERROR(\"연구책임자  \"&INDEX(과제등록요청서!$B$12:$B$24,MATCH(\"연구책임자\",과제등록요청서!$C$12:$C$24,0))&\"  (서명 또는 인)\",\"\")","v":""}]
[]
["과제 등록 요청을 위한 제출서류 :\n(협약용) 사업계획서, (참여연구원별)참여연구원 등록 요청서,신분증 사본, 통장사본, 건강보험자격득실확인서"]
[{"$f":"IF(E7=\"공동\",\"※ 공동연구의 경우 [실적 배분 신청서] 탭의 신청서 작성 병행 제출\",\"\")","v":""}]

{"sheet":"참여연구원등록조서","index":2,"n_rows":139,"n_cols":7,"rows_kept":139,"cut":false,"hidden":false,"merged":[[139,0,139,6],[125,0,127,6],[111,0,111,6],[130,0,130,6],[131,0,131,6],[134,0,134,6],[135,0,135,6],[133,0,133,6],[132,0,132,6],[122,1,122,6],[123,1,123,6],[138,0,138,6],[137,0,137,6],[118,0,118,6],[120,0,120,6],[107,0,107,6],[112,0,112,6],[113,0,113,6],[102,0,104,6],[117,0,117,6],[110,0,110,6],[109,0,109,6],[108,0,108,6],[114,0,114,6],[115,0,115,6],[99,0,99,6],[13,0,13,2],[13,3,13,4],[13,5,13,6],[22,0,22,6],[24,5,24,6],[26,4,26,6],[14,1,14,2],[15,1,15,2],[16,1,16,2],[17,0,17,6],[18,0,18,2],[18,3,18,6],[19,1,19,2],[20,1,20,2],[20,5,20,6],[6,1,6,6],[7,1,7,2],[11,0,11,6],[12,0,12,2],[12,3,12,6],[8,1,8,6],[10,1,10,2],[9,1,9,2],[5,1,5,2],[0,0,0,6],[2,0,2,2],[3,1,3,2],[4,1,4,2],[28,0,28,6],[57,0,58,6],[68,0,69,6],[72,0,73,6],[75,0,75,6],[74,0,74,6],[77,0,77,6],[79,0,80,6],[90,0,91,6],[94,0,95,6],[97,0,97,6],[96,0,96,6]]}
["참여연구원 등록 요청서"]
[]
["연구원 및 참여과제 기본정보"]
["소속구분","상명대학교",null,"교번 / 학번",null,"주민등록번호"]
["이름",null,null,"국내거주구분",null,"국적구분"]
["전화번호",null,null,"핸드폰",null,"이메일"]
["주소"]
["은행명",null,null,"계좌번호",null,"예금주"]
["과제명",{"$f":"과제등록요청서!C4","v":0}]
["참여기간",{"$f":"IFERROR(VLOOKUP(B5,과제등록요청서!$B$12:$E$24,3,0),\"\")","v":""},null,"~",{"$f":"IFERROR(VLOOKUP(B5,과제등록요청서!$B$12:$E$24,4,0),\"\")","v":""},"급여지급여부",{"$f":"IFERROR(VLOOKUP(B5,과제등록요청서!$B$12:$I$24,8,FALSE),\"\")","v":""}]
["월기준금액",{"$f":"IFERROR(VLOOKUP(B5,과제등록요청서!$B$12:$H$24,5,FALSE),\"\")","v":""},null,"참여율",{"$f":"IFERROR(VLOOKUP(B5,과제등록요청서!$B$12:$H$24,6,FALSE),\"\")","v":""},"월지급예정액",{"$f":"IFERROR(VLOOKUP(B5,과제등록요청서!$B$12:$H$24,7,FALSE),\"\")","v":""}]
[]
["현재신분정보"]
["상명대학교 소속",null,null,"타대학 소속",null,"대학외 타기관 소속"]
["소속구분",null,null,"소속대학",null,"소속회사명"]
["학부(전공)",null,null,"학부(전공)",null,"부서"]
["신분",null,null,"신분",null,"직급"]
[]
["최종학위정보"]
["출신기관(대학)",null,null,"학과",null,"전공"]
["최종학위",null,null,"최종학위일"]
[]
["본인은 상기 과제에 참여를 위하여 해당 정보를 확인 제출하오니 참여연구원으로 등록하여 주시기 바랍니다.  "]
[]
[{"$nulls":5},{"$f":"TODAY()","v":"2018-08-04"}]
[]
[{"$nulls":4},{"$f":"\"작성 및 제출자 :  \"&B5&\"    (인)\"","v":"작성 및 제출자 :      (인)"}]
[]
["개인정보 제공 및 활용 동의서"]
[]
["1. 개인정보의 제공 및 활용 동의"]
[]
[]
[]
["소속구분","국내거주구분","국적구분"]
["상명대학교","거주","내국인"]
["타대학","비거주","외국인"]
["대학외 타기관"]
["소속없음"]
[]
[]
[]
[]
["상명 소속구분","역할","신분","급여지급구분","최종학위"]
["상명대학교","책임연구원","전임교원","지급","박사"]
["입력안함","공동연구원","연구전임교수","미지급","석사"]
[null,"연구원","연구원",null,"학사"]
[null,"연구보조원","박사후연구원",null,"고졸"]
[null,null,"박사과정",null,"석박사"]
[null,null,"박사수료",null,"명예박사"]
[null,null,"석사과정",null,"전문학사"]
[null,null,"석사수료",null,"기타"]
[null,null,"학부재학생"]
[null,null,"산학인사"]
[null,null,"기타"]
[null,null,"청년인턴"]
[]
["본인은 \"참여연구원 등록 요청서\"와 관련하여 다음의 개인정보를 상명대학교 천안산학협력단 및 제3자(연구전문기관)에게 제공 활용하는 것에 대하여 내용을 이해하고 이에 동의 합니다. "]
[]
[]
["◈ 수집∙이용 목적"]
["► 연구처·산학협력단의 연구과제 수행 및 각종 수당 지급을 위한 자료로 활용합니다."]
["► 제 3자에게 제공 시 감사 및 실사, 정밀 정산 등 연구종료 후 관리를 위한 자료로 활용합니다."]
[]
["◈ 수집 · 이용할 개인정보 항목"]
["► 일반정보: 성명, 소속기관/직위, 연락처, 계좌번호, 자택주소, 학력정보, 연구비 정보"]
[]
["◈ 보유 · 이용기간"]
["► 위 개인정보는 상명대학교 천안산학협력단 문서의 보관,보존 규정에 따라 수집 이용에 관한 동의일로부터 5년(60개월)간 보유 이용되며 기간 경과 후 지체 없이 파기합니다."]
[]
[]
["◈ 동의를 거부할 권리 및 동의를 거부할 경우의 불이익"]
["► 개인정보 제공 및 활용 동의를 거부할 수 있으나, 미동의시 연구과제 수행 및 수당 지급에 제한이 있을 수 있습니다."]
[]
[{"$f":"F25","v":"2018-08-04"}]
[{"$f":"\"위의 사항을 숙지하였으며, 이에 동의합니다. □          확인자 : \"&B5&\"   (서명 또는 인)\"","v":"위의 사항을 숙지하였으며, 이에 동의합니다. □          확인자 :    (서명 또는 인)"}]
[]
["2. 고유식별정보의 제공 및 활용 동의"]
[]
["  본인은 \"참여연구원 등록 요청서\" 관련하여 다음의 개인정보를 상명대학교 천안산학협력단 및 제 3자(연구전문기관)에게 제공하고 활용하는 것에 대하여 내용을 이해하고 이에 동의합니다."]
[]
[]
["◈ 수집 이용목적"]
["► 연구처·산학협력단의 연구과제 수행 및 각종 수당 지급을 위한 자료로 활용합니다."]
["► 제 3자에게 제공 시 감사 및 실사, 정밀 정산 등 연구종료 후 관리를 위한 자료로 활용합니다."]
[]
["◈ 수집 이용할 개인정보 항목"]
["► 고유식별정보 : 주민등록번호, 학번(사번) "]
[]
["◈ 보유 이용기간"]
["► 위 개인정보는 상명대학교 천안산학협력단 문서의 보관,보존 규정에 따라 수집 이용에 관한 동의일로부터 5년(60개월)간 보유 이용되며 기간 경과 후 지체 없이 파기합니다."]
[]
[]
["◈ 동의를 거부할 권리 및 동의를 거부할 경우의 불이익"]
["► 개인정보 제공 및 활용 동의를 거부할 수 있으나, 미동의시 연구과제 수행 및 수당 지급에 제한이 있을 수 있습니다."]
[]
[{"$f":"F25","v":"2018-08-04"}]
[{"$f":"\"위의 사항을 숙지하였으며, 이에 동의합니다. □          확인자 : \"&B5&\"   (서명 또는 인)\"","v":"위의 사항을 숙지하였으며, 이에 동의합니다. □          확인자 :    (서명 또는 인)"}]
[]
["연구안전관리서약서"]
[]
[]
["    본인은 연구책임자(연구실책임자)로서 안전사고 예방 및 참여연구원(연구활동종사자)의 안전확보를 위하여  「연구실 안전환경 조성에 관한 법령」, 「상명대학교 연구실안전관리규정」, 연구 및 실험실습과 관련된 안전 수칙 등에 의거한 준수 사항을 충실히 이행할 것이며 이를 위반 하여 안전사고가 발생할 시 그에 합당한 민형사상의 모든 책임을 다할 것을 서약합니다"]
[]
[]
[]
["◈ 주요 준수 사항"]
["► 연구 및 실험실습과 관련된 안전 법령, 규정, 지침 등을 숙지하고 준수한다."]
["► 연구 및 실험실습 중 발생할 수 있는 안전사고에 대한 대비 및 대응 할수 있도록 안전계획을 수립한다"]
["► 연구실 및 실험실 내 관련 안전수칙을 상시 비치하여 연구활동종사자가 숙지 및 준수할 수 있도록 한다."]
["► 연구 및 실험실습 시작 전 안전교육을 실시한다"]
["► 유해물질, 중장비 등 안전사고로 이어질 수 있는 위험요소에 안전표지를 부착한다."]
["► 연구 및 실험실습과 관련하여 필요한 안전장비를 연구활동종사자에게 지급하고 연구실 및 실험실 내 필요한 안전장치(시설)를 설치한다."]
["► 연구 및 실험실습 시작전 안전점검 및 안전사고 방지를 위한 사전 조치를 시행한다"]
["► 연구실 및 실험실 내 사고발생 시 즉시 보고하고 조치하여 피해를 최소화 하는데 최선을 다한다."]
["► '참여연구원(연구활동종사자)' 중 '연구실안전관리담당자'를 지정하고 교육하여 본인 부재시 연구 및 실험실습과 관련한 안전조치가 이행될 수 있도록 한다."]
[]
[{"$f":"F25","v":"2018-08-04"}]
[{"$f":"IFERROR(\"연구책임자     \"&INDEX(과제등록요청서!$B$12:$B$24,MATCH(\"연구책임자\",과제등록요청서!$C$12:$C$24,0))&\"   (서명 또는 인)\",\"\")","v":""}]
[]
["연구안전서약서"]
[]
["연구과제명",{"$f":"B9","v":0}]
["과제기간",{"$f":"TEXT(B10,\"yyyy년 mm월 dd일\")&\"  ~  \"&TEXT(E10,\"yyyy년 mm월 dd일\")","v":"  ~  "}]
[]
["    본인은 위 연구과제에 참여함에 있어 「연구실 안전환경 조성에 관한 법령」, 「상명대학교 연구실안전관리규정」, 연구 및 실험실습과 관련된 안전 수칙 연구 및 실험실습과 관련된 안전 수칙에 의거한 준수사항을 충실히 이행할것이며 이를 위반하여 안전사고가 발생할 시 그에 합당한 민형사상의 모든 책임을 다할 것을 서약합니다"]
[]
[]
[]
["◈ 주요 준수 사항"]
["► 연구 및 실험실습과 관련된 안전 법령, 규정, 지침 등을 숙지하고 준수한다."]
["► 연구책임자(연구실책임자) 및 '연구실안전관리담당자'의 안전 지시에 따라 연구 및 실험실습에 임하며 연구 목적 외 개인 행동을 하지 않는다"]
["► 연구실 및 실험실 내 비치된 안전수칙에 따라 연구 및 실험실습에 임한다"]
["► 안전교육 및 훈련에 적극 참여한다"]
["► 연구 및 실험실습 중 항상 안전장비를 착용하고 설치된 안전장치(시설)를 활용한다"]
["► 사전 안전점검 없이 연구 및 실험실습을 시행하지 않는다"]
[]
[{"$f":"F25","v":"2018-08-04"}]
[{"$f":"\"성명 : \"&B5&\"   (서명 또는 인)\"","v":"성명 :    (서명 또는 인)"}]

{"sheet":"실적 배분 신청서","index":3,"n_rows":36,"n_cols":14,"rows_kept":36,"cut":false,"hidden":false,"merged":[[4,0,4,13],[5,0,5,13],[6,0,6,1],[6,2,6,6],[6,7,6,8],[6,9,6,13],[7,0,7,1],[7,2,7,13],[8,0,9,1],[8,2,8,3],[8,4,8,6],[8,7,9,8],[8,9,8,10],[8,11,8,12],[9,2,9,3],[13,0,13,13],[14,0,14,1],[14,2,14,4],[14,5,14,6],[14,7,14,8],[14,9,14,11],[14,12,14,13],[9,9,9,10],[9,11,9,12],[10,0,12,1],[10,2,10,4],[10,5,10,7],[10,8,10,13],[11,2,11,4],[11,5,11,7],[11,8,11,13],[12,2,12,13],[9,4,9,5],[16,0,16,1],[16,2,16,4],[16,5,16,6],[16,7,16,8],[16,9,16,11],[16,12,16,13],[15,0,15,1],[15,2,15,4],[15,5,15,6],[15,7,15,8],[15,9,15,11],[15,12,15,13],[18,0,18,1],[18,2,18,4],[18,5,18,6],[18,7,18,8],[18,9,18,11],[18,12,18,13],[17,0,17,1],[17,2,17,4],[17,5,17,6],[17,7,17,8],[17,9,17,11],[17,12,17,13],[20,0,20,1],[20,2,20,4],[20,5,20,6],[20,7,20,8],[20,9,20,11],[20,12,20,13],[19,0,19,1],[19,2,19,4],[19,5,19,6],[19,7,19,8],[19,9,19,11],[19,12,19,13],[22,0,22,1],[22,2,22,4],[22,5,22,6],[22,7,22,8],[22,9,22,11],[22,12,22,13],[21,0,21,1],[21,2,21,4],[21,5,21,6],[21,7,21,8],[21,9,21,11],[21,12,21,13],[24,0,24,1],[24,2,24,4],[24,5,24,6],[24,7,24,8],[24,9,24,11],[24,12,24,13],[23,0,23,1],[23,2,23,4],[23,5,23,6],[23,7,23,8],[23,9,23,11],[23,12,23,13],[26,0,26,1],[26,2,26,4],[26,5,26,6],[26,7,26,8],[26,9,26,11],[26,12,26,13],[25,0,25,1],[25,2,25,4],[25,5,25,6],[25,7,25,8],[25,9,25,11],[25,12,25,13],[28,0,28,1],[28,2,28,4],[28,5,28,6],[28,7,28,8],[28,9,28,11],[28,12,28,13],[27,0,27,1],[27,2,27,4],[27,5,27,6],[27,7,27,8],[27,9,27,11],[27,12,27,13],[34,0,34,13],[35,0,35,13],[30,0,30,8],[30,9,30,11],[30,12,30,13],[31,0,31,1],[31,2,31,13],[33,0,33,13],[29,0,29,1],[29,2,29,4],[29,5,29,6],[29,7,29,8],[29,9,29,11],[29,12,29,13]]}
[]
[]
[]
[]
["외부연구비 수주 실적 배분 신청서"]
[]
["1. 지원기관",{"$nulls":6},"2. 사업명"]
["3. 과제명"]
["4. 연구책임자",null,"소속",{"$nulls":4},"5. 당해연구기간",null,"연구시작일",null,"연구종료일",null,"개월수"]
[null,null,"성명",null,null,null,"(인)",{"$nulls":6},{"$f":"IF(OR(L10=\"\", J10=\"\"), \"총      개월\", (YEAR(L10)-YEAR(J10))*12+MONTH(L10)-MONTH(J10)+(DAY(L10)-DAY(J10))/30)","v":"총      개월"}]
["6. 당해사업비",null,"총액(A)",null,null,"협동연구비(B)",null,null,"수주 실적액[(D)=A-(B+C)]"]
[{"$nulls":8},{"$f":"C12-F12","v":0}]
[null,null,"수주 실적액'은 실 계약내용에 따라 변경 될수 있음"]
["7. 수주 실적액 배분 계획 [연구원으로 등록된 본교 전임교원에 한함]"]
["순번",null,"소속",null,null,"성명",null,"참여구분",null,"배분율",null,null,"서명"]
[1]
[2]
[3]
[4]
[5]
[6]
[7]
[8]
[9]
[10]
[11]
[12]
[13]
[14]
[15]
["합계",{"$nulls":8},{"$f":"IF(SUM(J16:L30)<1,\"연구실적물의 합은 100% 이어야 합니다\",SUM(J16:L30))","v":"연구실적물의 합은 100% 이어야 합니다"}]
["비고",null,"본 배분 대상 실적은 연구제안서 및 계획서에 의하여 참여연구원으로 등록된 전임교원을 대상으로 하며 외부연구비 수주를 위하여 기여한 배분실적을 의미합니다.\n\n※ 본 배분 신청서는 [4-1-4 교수업적평가 규정 (2016.9.1.) ‘산학영역 인정공식’]의 \"외부연구비수탁실적 및 간접비 수익\" 배분 시, 동일 비율로 적용됩니다."]
[]
["교원인사규정 제 17조 1항 3호 및 교원학술연구규정 제 5조 5항 에 의거한 연구실적물로서\n위 '외부연구비 수주액' 실적을 위 와 같이 배분 요청합니다"]
[{"$f":"TODAY()","v":"2018-08-04"}]
["상명대학교 천안산학협력단장 귀하"]

{"sheet":"Sheet1","index":4,"n_rows":14,"n_cols":5,"rows_kept":14,"cut":false,"hidden":true,"merged":[[13,0,14,0]]}
{"$rows_empty":8}
[null,null,null,"연구책임자"]
[null,null,null,"공동연구원"]
[]
[]
[]
["결\n\n재","담  당","주임/과장","팀/국장","처/단장"]